{"text_format":"1","workbook":"xlsx","n_sheets":8,"sheets":["Hovedmeny","Avansert","VedleggAvansert","Enkel","VedleggEnkel","ForutsetningEnkel","Grunndata","GrunndataEnkel"],"not_rendered":{"charts":0,"images":1,"macros":1,"external_links":0,"defined_names":6,"comments":3,"pivot_tables":0},"unopened":[],"bounds":{"document_bytes":16777216,"sheet_cells":100000,"rows_first":2000,"rows_last":500,"rows_between":2000,"halvings":0,"cell_chars":16384,"cell_head_chars":4096},"cells_cut":0,"cells_raw":0,"read":"whole","date_system":"1900"}

{"sheet":"Hovedmeny","index":0,"n_rows":18,"n_cols":14,"rows_kept":18,"cut":false,"hidden":false,"merged":[[2,13,2,31]]}
[]
[]
[null,null,null,null,null,null,null,null,null,null,null,null,null,"Lønnsomhetsberegning for skogsveier"]
[]
[]
[]
[]
[]
[]
[]
[]
[]
[]
[]
[]
{"$rows_left_out":4}
{"sheet":"Avansert","index":1,"n_rows":98,"n_cols":65,"rows_kept":98,"cut":false,"hidden":false,"merged":[[67,5,68,7],[67,2,68,4],[38,1,39,1],[1,2,1,6]]}
[]
[null,null,"Lønnsomhetsberegning av skogsveier",null,null,null,null,null,null,null,null,"Inntekt"]
[null,null,null,null,null,null,null,null,null,null,null,"Sagtømmer","Massev.","sum","Kostnad","Innsparing"]
[null,"Velg veitype"]
[null,null,1]
[null,"Andel utilgjeng uten vei",null,null,null,null,null,null,null,null,"Nullområde",{"$f":"C9*((E22+G22)*C6)","v":0},{"$f":"E9*C22*C6","v":0},{"$f":"SUM(L6:M6)","v":0},{"$f":"(C11+E11)*((C22+E22+G22)*C6)","v":0},{"$f":"L6-O6","v":0}]
[null,"Jakt, fiske, friluftsliv o.a.",null,"kr/år",null,null,null,null,null,null,null,null,null,null,null,null,null,null,null,null,null,null,null,null,null,null,null,null,"Før tilskudd",null,null,"Før tilskudd",null,null,"Før tilskudd",null,null,"Før tilskudd",null,null,null,"Etter tilskudd",null,null,"Etter tilskudd",null,null,"Etter tilskudd",null,null,"Etter tilskudd",null,null,null,"Etter tilskudd og skogfond",null,null,"Etter tilskudd og skogfond",null,null,"Etter tilskudd og skogfond",null,null,"Etter tilskudd og skogfond"]
[null,null,"Sagtømmer",null,"Massevirke",null,null,null,null,null,null,"III",null,"IV",null,"V",null,null,null,null,null,null,null,null,null,null,null,"20år","20år","20år","25år","25år","25år","30år","30år","30år","40år","40år","40år",null,"20år","20år","20år","25år","25år","25år","30år","30år","30år","40år","40år","40år",null,"20år","20år","20år","25år","25år","25år","30år","30år","30år","40år","40år","40år"]
[null,"Tømmerpriser",null,"kr/m3",null,"kr/m3",null,null,null,null,"Hogst","Hogstmaskin","Motorsag","Hogstmaskin","Motorsag","Hogstmaskin","Motorsag","sum",null,null,null,null,null,null,null,null,null,null,null,"int.rente",null,null,"int.rente",null,null,"int.rente",null,null,"int.rente",null,"Etter tilskudd",null,"int.rente",null,null,"int.rente",null,null,"int.rente",null,null,"int.rente",null,"Etter tilskudd",null,"int.rente",null,null,"int.rente",null,null,"int.rente",null,null,"int.rente"]
[null,"Driftspriser","Hogst",null,"Utkjøring",null,"Sum",null,null,null,"m3",{"$f":"C22*C29","v":0},{"$f":"C22*C30","v":0},{"$f":"E22*E29","v":0},{"$f":"E22*E30","v":0},{"$f":"G22*G29","v":0},{"$f":"G22*G30","v":0},{"$f":"SUM(L10:Q10)","v":0},null,null,null,null,null,null,null,null,"Vedlikehold","Innsparing","Int.rente",{"$f":"IF($L$86=0,\"\",IRR(AC11:AC31))","v":""},"Innsparing","Int.rente",{"$f":"IF($L$86=0,\"\",IRR(AF11:AF36))","v":""},"Innsparing","Int.rente",{"$f":"IF($L$86=0,\"\",IRR(AI11:AI41))","v":""},"Innsparing","Int.rente",{"$f":"IF($L$86=0,\"\",IRR(AL11:AL51))","v":""},null,"Innsparing","Int.rente",{"$f":"IF($L$86=0,\"\",IRR(AP11:AP31))","v":""},"Innsparing","Int.rente",{"$f":"IF($L$10=0,\"\",IRR(AS11:AS36))","v":""},"Innsparing","Int.rente",{"$f":"IF($L$10=0,\"\",IRR(AV11:AV41))","v":""},"Innsparing","Int.rente",{"$f":"IF($L$10=0,\"\",IRR(AY11:AY51))","v":""},null,"Innsparing","Int.rente",{"$f":"IF($L$86=0,\"\",IRR(BC11:BC31))","v":""},"Innsparing","Int.rente",{"$f":"IF($L$10=0,\"\",IRR(BF11:BF36))","v":""},"Innsparing","Int.rente",{"$f":"IF($L$10=0,\"\",IRR(BI11:BI41))","v":""},"Innsparing","Int.rente",{"$f":"IF($L$10=0,\"\",IRR(BL11:BL51))","v":""}]
[null,"Slutthogst",null,"kr/m3",null,"kr/m3",{"$f":"C11+E11","v":0},"kr/m3",null,null,"Innspart transp",{"$f":"C46-E46","v":0},{"$f":"$L$11","v":0},{"$f":"$L$11","v":0},0,0,0,{"$f":"SUM(L11:Q11)","v":0},null,null,null,null,null,null,null,0,null,null,{"$f":"$L$86*-1","v":0},null,null,{"$f":"$L$86*-1","v":0},null,null,{"$f":"$L$86*-1","v":0},null,null,{"$f":"$L$86*-1","v":0},null,0,null,{"$f":"$L$86*(1-$C$54)*-1","v":0},null,null,{"$f":"$L$86*(1-$C$54)*-1","v":0},null,null,{"$f":"$L$86*(1-$C$54)*-1","v":0},null,null,{"$f":"$L$86*(1-$C$54)*-1","v":0},null,0,null,{"$f":"$N$89*-1","v":{"$error":"#DIV/0!"}},null,null,{"$f":"$N$89*-1","v":{"$error":"#DIV/0!"}},null,null,{"$f":"$N$89*-1","v":{"$error":"#DIV/0!"}},null,null,{"$f":"$N$89*-1","v":{"$error":"#DIV/0!"}}]
[null,"Tynning",null,"kr/m3",null,"kr/m3",{"$f":"C12+E12","v":0},"kr/m3",null,null,"Antall 100 m",{"$f":"L11/100","v":0},{"$f":"M11/100","v":0},0,0,0,0,0,null,null,null,null,null,null,null,1,null,null,{"$f":"$C$7+$C$53-$C$60+AB12","v":0},null,null,{"$f":"$C$7+$C$53-$C$60+AE12","v":0},null,null,{"$f":"$C$7+$C$53-$C$60+AH12","v":0},null,null,{"$f":"$C$7+$C$53-$C$60+AK12","v":0},null,1,null,{"$f":"AO12-$AA$12","v":0},null,null,{"$f":"AR12-$AA$12","v":0},null,null,{"$f":"AU12-$AA$12","v":0},null,null,{"$f":"AX12-$AA$12","v":0},null,1,null,{"$f":"$C$7+$C$53-$C$60+BB12","v":0},null,null,{"$f":"$C$7+$C$53-$C$60+BE12","v":0},null,null,{"$f":"$C$7+$C$53-$C$60+BH12","v":0},null,null,{"$f":"$C$7+$C$53-$C$60+BK12","v":0}]
[null,null,"I","II","III","IV","V",null,null,null,"kr/time",{"$f":"E32","v":0},{"$f":"E33","v":0},{"$f":"L13","v":0},{"$f":"M13","v":0},{"$f":"L13","v":0},{"$f":"M13","v":0},0,null,null,null,null,null,null,null,2,null,{"$f":"$W$62/$O$62","v":{"$error":"#DIV/0!"}},{"$error":"#DIV/0!"},null,{"$f":"$W$62/$O$62","v":{"$error":"#DIV/0!"}},{"$error":"#DIV/0!"},null,{"$f":"$W$62/$O$62","v":{"$error":"#DIV/0!"}},{"$error":"#DIV/0!"},null,{"$f":"$W$62/$O$62","v":{"$error":"#DIV/0!"}},{"$error":"#DIV/0!"},null,2,{"$f":"$W$62/$O$62","v":{"$error":"#DIV/0!"}},{"$f":"AO13-$AA$12","v":{"$error":"#DIV/0!"}},null,{"$f":"$W$62/$O$62","v":{"$error":"#DIV/0!"}},{"$f":"AR13-$AA$12","v":{"$error":"#DIV/0!"}},null,{"$f":"$W$62/$O$62","v":{"$error":"#DIV/0!"}},{"$f":"AU13-$AA$12","v":{"$error":"#DIV/0!"}},null,{"$f":"$W$62/$O$62","v":{"$error":"#DIV/0!"}},{"$f":"AX13-$AA$12","v":{"$error":"#DIV/0!"}},null,2,{"$f":"($W$62*(1-$C$66))/$O$62","v":{"$error":"#DIV/0!"}},{"$error":"#DIV/0!"},null,{"$f":"$W$62/$O$62","v":{"$error":"#DIV/0!"}},{"$error":"#DIV/0!"},null,{"$f":"$W$62/$O$62","v":{"$error":"#DIV/0!"}},{"$error":"#DIV/0!"},null,{"$f":"$W$62/$O$62","v":{"$error":"#DIV/0!"}},{"$error":"#DIV/0!"}]
[null,"Areal - hogstklasse",null,null,null,null,null,"daa",{"$f":"SUM(C14:G14)","v":0},null,"min/100 m",{"$f":"LOOKUP(I47,Grunndata!B41:C56)","v":{"$error":"#N/A"}},{"$f":"LOOKUP(I47,Grunndata!F41:G56)","v":{"$error":"#N/A"}},{"$f":"L14","v":{"$error":"#N/A"}},{"$f":"M14","v":{"$error":"#N/A"}},{"$f":"N14","v":{"$error":"#N/A"}},{"$f":"O14","v":{"$error":"#N/A"}},{"$error":"#N/A"},null,null,null,null,null,null,null,3,null,null,0,null,null,0,null,null,0,null,null,0,null,3,null,0,null,null,0,null,null,0,null,null,0,null,3,null,0,null,null,0,null,null,0,null,null,0]
[null,null,"Planting",null,"Rydding",null,"Tynning",null,null,null,"Antall dager",{"$f":"L10/C32","v":{"$error":"#DIV/0!"}},{"$f":"IF(M10=0,0,M10/C33)","v":0},{"$f":"N10/C32","v":{"$error":"#DIV/0!"}},{"$f":"IF(O10=0,0,O10/C33)","v":0},{"$f":"P10/C32","v":{"$error":"#DIV/0!"}},{"$f":"IF(Q10=0,0,Q10/C33)","v":0},{"$error":"#DIV/0!"},null,null,null,null,null,null,null,4,null,null,0,null,null,0,null,null,0,null,null,0,null,4,null,0,null,null,0,null,null,0,null,null,0,null,4,null,0,null,null,0,null,null,0,null,null,0]
{"$rows_left_out":84}
{"sheet":"VedleggAvansert","index":2,"n_rows":53,"n_cols":30,"rows_kept":53,"cut":false,"hidden":false,"merged":[]}
[]
[null,null,null,null,null,null,null,null,null,null,null,"VEDLEGG TIL LØNNSOMHETSBEREGNING FOR SKOGVEI"]
[]
[]
[]
[]
[null,"Til:"]
[]
[null,"Søkerens navn:"]
[]
[null,"Adresse:"]
[]
[null,"Veiens navn:",null,null,null,null,null,null,"",null,null,null,null,null,null,null,null,null,null,null,null,null,"Planlegger:",null,null,null,""]
[]
[null,"FORUTSETNINGER"]
{"$rows_left_out":39}
{"sheet":"Enkel","index":3,"n_rows":98,"n_cols":65,"rows_kept":98,"cut":false,"hidden":false,"merged":[[61,1,62,1],[27,2,28,4],[27,5,28,7],[1,2,1,7]]}
["A"]
[null,null,"Enkel lønnsomhetsberegning av skogsveier",null,null,null,null,null,null,null,null,"Inntekt"]
[null,null,null,null,null,null,null,null,null,null,null,"Sagtømmer","Massev.","sum","Kostnad","Innsparing"]
[null,"Velg veitype"]
[null,null,1]
[null,null,"I","II","III","IV","V",null,null,null,"Nullområde",{"$f":"C42*((E9+G9)*C39)","v":0},{"$f":"E42*C9*C39","v":0},{"$f":"SUM(L6:M6)","v":0},{"$f":"(C44+E44)*((C9+E9+G9)*C39)","v":0},{"$f":"L6-O6","v":0}]
[null,"Areal - hogstklasse",null,null,null,null,null,"daa",{"$f":"SUM(C7:G7)","v":0},null,null,null,null,null,null,null,null,null,null,null,null,null,null,null,null,null,null,null,"Før tilskudd",null,null,"Før tilskudd",null,null,"Før tilskudd",null,null,"Før tilskudd",null,null,null,"Etter tilskudd",null,null,"Etter tilskudd",null,null,"Etter tilskudd",null,null,"Etter tilskudd",null,null,null,"Etter tilskudd og skogfond",null,null,"Etter tilskudd og skogfond",null,null,"Etter tilskudd og skogfond",null,null,"Etter tilskudd og skogfond"]
[null,null,"III",null,"IV",null,"V",null,null,null,null,"III",null,"IV",null,"V",null,null,null,null,null,null,null,null,null,null,null,"20år","20år","20år","25år","25år","25år","30år","30år","30år","40år","40år","40år",null,"20år","20år","20år","25år","25år","25år","30år","30år","30år","40år","40år","40år",null,"20år","20år","20år","25år","25år","25år","30år","30år","30år","40år","40år","40år"]
[null,"Forventet avvirkning",null,"m3",null,"m3",null,"m3",{"$f":"SUM(C9,E9,G9)","v":0},null,"Hogst","Hogstmaskin","Motorsag","Hogstmaskin","Motorsag","Hogstmaskin","Motorsag","sum",null,null,null,null,null,null,null,null,null,null,null,"int.rente",null,null,"int.rente",null,null,"int.rente",null,null,"int.rente",null,"Etter tilskudd",null,"int.rente",null,null,"int.rente",null,null,"int.rente",null,null,"int.rente",null,"Etter tilskudd",null,"int.rente",null,null,"int.rente",null,null,"int.rente",null,null,"int.rente"]
[null,"Andel avvirkning","III",null,"IV",null,"V",null,null,null,"m3",{"$f":"C9*C53","v":0},{"$f":"C9*C54","v":0},{"$f":"E9*E53","v":0},{"$f":"E9*E54","v":0},{"$f":"G9*G53","v":0},{"$f":"G9*G54","v":0},{"$f":"SUM(L10:Q10)","v":0},null,null,null,null,null,null,null,null,"Vedlikehold","Innsparing","Int.rente",{"$f":"IF($L$86=0,\"\",IRR(AC11:AC31))","v":""},"Innsparing","Int.rente",{"$f":"IF($L$86=0,\"\",IRR(AF11:AF36))","v":""},"Innsparing","Int.rente",{"$f":"IF($L$86=0,\"\",IRR(AI11:AI41))","v":""},"Innsparing","Int.rente",{"$f":"IF($L$86=0,\"\",IRR(AL11:AL51))","v":""},null,"Innsparing","Int.rente",{"$f":"IF($L$86=0,\"\",IRR(AP11:AP31))","v":""},"Innsparing","Int.rente",{"$f":"IF($L$10=0,\"\",IRR(AS11:AS36))","v":""},"Innsparing","Int.rente",{"$f":"IF($L$10=0,\"\",IRR(AV11:AV41))","v":""},"Innsparing","Int.rente",{"$f":"IF($L$10=0,\"\",IRR(AY11:AY51))","v":""},null,"Innsparing","Int.rente",{"$f":"IF($L$86=0,\"\",IRR(BC11:BC31))","v":""},"Innsparing","Int.rente",{"$f":"IF($L$10=0,\"\",IRR(BF11:BF36))","v":""},"Innsparing","Int.rente",{"$f":"IF($L$10=0,\"\",IRR(BI11:BI41))","v":""},"Innsparing","Int.rente",{"$f":"IF($L$10=0,\"\",IRR(BL11:BL51))","v":""}]
[null,"Sum",{"$f":"SUM(C12:C14)","v":0},{"$f":"IF(C11=0,\"\",IF(C11=D12,\"\",\"OBS!\"))","v":""},{"$f":"SUM(E12:E14)","v":0},{"$f":"IF(E11=0,\"\",IF(E11=F12,\"\",\"OBS!\"))","v":""},{"$f":"SUM(G12:G14)","v":0},{"$f":"IF(G11=0,\"\",IF(G11=H12,\"\",\"OBS!\"))","v":""},null,null,"Innspart transp",{"$f":"C16-E16","v":0},{"$f":"$L$11","v":0},{"$f":"$L$11","v":0},0,0,0,{"$f":"SUM(L11:Q11)","v":0},null,null,null,null,null,null,null,0,null,null,{"$f":"$L$86*-1","v":0},null,null,{"$f":"$L$86*-1","v":0},null,null,{"$f":"$L$86*-1","v":0},null,null,{"$f":"$L$86*-1","v":0},null,0,null,{"$f":"$L$86*(1-$C$22)*-1","v":0},null,null,{"$f":"$L$86*(1-$C$22)*-1","v":0},null,null,{"$f":"$L$86*(1-$C$22)*-1","v":0},null,null,{"$f":"$L$86*(1-$C$22)*-1","v":0},null,0,null,{"$f":"$N$89*-1","v":{"$error":"#DIV/0!"}},null,null,{"$f":"$N$89*-1","v":{"$error":"#DIV/0!"}},null,null,{"$f":"$N$89*-1","v":{"$error":"#DIV/0!"}},null,null,{"$f":"$N$89*-1","v":{"$error":"#DIV/0!"}}]
[null,"før 5 år",null,1,null,1,null,1,null,null,"Antall 100 m",{"$f":"L11/100","v":0},{"$f":"M11/100","v":0},0,0,0,0,0,null,null,null,null,null,null,null,1,null,null,{"$f":"$C$40+$C$69-$C$24+AB12","v":0},null,null,{"$f":"$C$40+$C$69-$C$24+AE12","v":0},null,null,{"$f":"$C$40+$C$69-$C$24+AH12","v":0},null,null,{"$f":"$C$40+$C$69-$C$24+AK12","v":0},null,1,null,{"$f":"AO12-$AA$12","v":0},null,null,{"$f":"AR12-$AA$12","v":0},null,null,{"$f":"AU12-$AA$12","v":0},null,null,{"$f":"AX12-$AA$12","v":0},null,1,null,{"$f":"$C$40+$C$69-$C$24+BB12","v":0},null,null,{"$f":"$C$40+$C$69-$C$24+BE12","v":0},null,null,{"$f":"$C$40+$C$69-$C$24+BH12","v":0},null,null,{"$f":"$C$40+$C$69-$C$24+BK12","v":0}]
[null,"5-10 år",null,null,null,null,null,null,null,null,"kr/time",{"$f":"E56","v":1200},{"$f":"E57","v":450},{"$f":"L13","v":1200},{"$f":"M13","v":450},{"$f":"L13","v":1200},{"$f":"M13","v":450},4950,null,null,null,null,null,null,null,2,null,{"$f":"$W$62/$O$62","v":{"$error":"#N/A"}},{"$error":"#N/A"},null,{"$f":"$W$62/$O$62","v":{"$error":"#N/A"}},{"$error":"#N/A"},null,{"$f":"$W$62/$O$62","v":{"$error":"#N/A"}},{"$error":"#N/A"},null,{"$f":"$W$62/$O$62","v":{"$error":"#N/A"}},{"$error":"#N/A"},null,2,{"$f":"$W$62/$O$62","v":{"$error":"#N/A"}},{"$f":"AO13-$AA$12","v":{"$error":"#N/A"}},null,{"$f":"$W$62/$O$62","v":{"$error":"#N/A"}},{"$f":"AR13-$AA$12","v":{"$error":"#N/A"}},null,{"$f":"$W$62/$O$62","v":{"$error":"#N/A"}},{"$f":"AU13-$AA$12","v":{"$error":"#N/A"}},null,{"$f":"$W$62/$O$62","v":{"$error":"#N/A"}},{"$f":"AX13-$AA$12","v":{"$error":"#N/A"}},null,2,{"$f":"($W$62*(1-$C$25))/$O$62","v":{"$error":"#N/A"}},{"$error":"#N/A"},null,{"$f":"$W$62/$O$62","v":{"$error":"#N/A"}},{"$error":"#N/A"},null,{"$f":"$W$62/$O$62","v":{"$error":"#N/A"}},{"$error":"#N/A"},null,{"$f":"$W$62/$O$62","v":{"$error":"#N/A"}},{"$error":"#N/A"}]
[null,"etter 10 år",null,null,null,null,null,null,null,null,"min/100 m",{"$f":"LOOKUP(I17,GrunndataEnkel!B41:C56)","v":{"$error":"#N/A"}},{"$f":"LOOKUP(I17,GrunndataEnkel!F41:G56)","v":{"$error":"#N/A"}},{"$f":"L14","v":{"$error":"#N/A"}},{"$f":"M14","v":{"$error":"#N/A"}},{"$f":"N14","v":{"$error":"#N/A"}},{"$f":"O14","v":{"$error":"#N/A"}},{"$error":"#N/A"},null,null,null,null,null,null,null,3,null,null,0,null,null,0,null,null,0,null,null,0,null,3,null,0,null,null,0,null,null,0,null,null,0,null,3,null,0,null,null,0,null,null,0,null,null,0]
[null,null,"Før vei",null,"Etter vei",null,null,null,null,null,"Antall dager",{"$f":"L10/C56","v":0},{"$f":"M10/C57","v":0},{"$f":"N10/C56","v":0},{"$f":"O10/C57","v":0},{"$f":"P10/C56","v":0},{"$f":"Q10/C57","v":0},0,null,null,null,null,null,null,null,4,null,null,0,null,null,0,null,null,0,null,null,0,null,4,null,0,null,null,0,null,null,0,null,null,0,null,4,null,0,null,null,0,null,null,0,null,null,0]
{"$rows_left_out":84}
{"sheet":"VedleggEnkel","index":4,"n_rows":54,"n_cols":30,"rows_kept":54,"cut":false,"hidden":false,"merged":[]}
[]
[]
[null,null,null,null,null,null,null,null,null,null,null,"VEDLEGG TIL LØNNSOMHETSBEREGNING FOR SKOGVEI"]
[]
[]
[]
[]
[null,"Til:"]
[]
[null,"Søkerens navn:"]
[]
[null,"Adresse:"]
[]
[null,"Veiens navn:",null,null,null,null,null,null,"",null,null,null,null,null,null,null,null,null,null,null,null,null,"Planlegger:",null,null,null,""]
[]
{"$rows_left_out":40}
{"sheet":"ForutsetningEnkel","index":5,"n_rows":48,"n_cols":8,"rows_kept":48,"cut":false,"hidden":false,"merged":[[1,1,1,7]]}
[]
[null,"Forutsetninger i den enkle lønnsomhetsberegningen"]
[]
[null,"Andel utilgjeng uten vei",0]
[null,"Jakt, fiske, friluftsliv o.a.",0,"kr/år"]
[null,null,"Sagtømmer",null,"Massevirke"]
[null,"Tømmerpriser",500,"kr/m3",200,"kr/m3"]
[null,"Driftspriser","Hogst",null,"Utkjøring",null,"Sum"]
[null,"Slutthogst",60,"kr/m3",60,"kr/m3",120,"kr/m3"]
[null,"Tynning",90,"kr/m3",100,"kr/m3",190,"kr/m3"]
[null,null,"Planting",null,"Rydding",null,"Tynning"]
[null,"Skogkultur - andel",0.3,null,0.1,null,0.2]
[]
[null,null,"planter/dag",null,"planter/daa",null,"kr/time"]
[null,"Planting",1000,null,250,null,400]
{"$rows_left_out":34}
{"sheet":"Grunndata","index":6,"n_rows":57,"n_cols":25,"rows_kept":57,"cut":false,"hidden":true,"merged":[]}
[null,"Korreksjonsfaktor",null,null,null,null,"Faktorer",null,null,null,"Terrengkjøring  G15-min/m3ub/100m"]
[null,null,"Helning",null,null,null,"Overflate","Helning",null,null,null,"Helning"]
["Overflate",1,2,3,4,1,1.1000000000000001,1.0009999999999999,"m3ub/lass","Overflate",1,2,3,4]
[1,{"$f":"G3*$H$3","v":1.1011},{"$f":"G3*$H$4","v":1.1121000000000001},{"$f":"G3*$H$5","v":1.1341000000000001},{"$f":"G3*$H$6","v":1.1847000000000001},2,1.2,1.0109999999999999,{"$f":"Avansert!C42","v":0},1,{"$f":"216/G11/$I$4","v":{"$error":"#DIV/0!"}},{"$error":"#DIV/0!"},{"$error":"#DIV/0!"},{"$error":"#DIV/0!"}]
[2,{"$f":"G4*$H$3","v":1.2011999999999998},{"$f":"G4*$H$4","v":1.2131999999999998},{"$f":"G4*$H$5","v":1.2371999999999999},{"$f":"G4*$H$6","v":1.2924},3,1.35,1.0309999999999999,null,2,{"$error":"#DIV/0!"},{"$error":"#DIV/0!"},{"$error":"#DIV/0!"},{"$error":"#DIV/0!"}]
[3,{"$f":"G5*$H$3","v":1.3513500000000001},{"$f":"G5*$H$4","v":1.3648499999999999},{"$f":"G5*$H$5","v":1.39185},{"$f":"G5*$H$6","v":1.4539500000000001},4,1.5,1.077,null,3,{"$error":"#DIV/0!"},{"$error":"#DIV/0!"},{"$error":"#DIV/0!"},{"$error":"#DIV/0!"}]
[4,{"$f":"G6*$H$3","v":1.5014999999999998},{"$f":"G6*$H$4","v":1.5164999999999997},{"$f":"G6*$H$5","v":1.5465},{"$f":"G6*$H$6","v":1.6154999999999999},null,null,null,null,4,{"$error":"#DIV/0!"},{"$error":"#DIV/0!"},{"$error":"#DIV/0!"},{"$error":"#DIV/0!"}]
[null,"Ganghastigher",null,"min/100m",null,"    Terrengkjøring  m/min- lassbærer",null,null,null,null,"    Terrengkjøring  m/min- stammel./traktor"]
[null,null,"Helning",null,null,null,null,"Helning",null,null,null,null,"Helning"]
["Overflate",1,2,3,4,"Overflate",1,2,3,4,"Overflate",1,2,3,4]
[1,3,{"$f":"B11*1.2","v":3.5999999999999996},{"$f":"B11*1.3","v":3.9000000000000004},{"$f":"B11*1.4","v":4.1999999999999993},1,65,63,57,42,1,100,{"$f":"H11/$G$11*$L$11","v":96.92307692307692},{"$f":"I11/$G$11*$L$11","v":87.692307692307693},64.615384615384613]
[2,3.8,{"$f":"B12*1.2","v":4.5599999999999996},{"$f":"B12*1.3","v":4.9399999999999995},{"$f":"B12*1.4","v":5.3199999999999994},2,58,53,47,33,2,{"$f":"G12/$G$11*$L$11","v":89.230769230769241},{"$f":"H12/$G$11*$L$11","v":81.538461538461533},72.307692307692307,50.769230769230766]
[3,4.5999999999999996,{"$f":"B13*1.2","v":5.52},{"$f":"B13*1.3","v":5.9799999999999995},{"$f":"B13*1.4","v":6.4399999999999995},3,50,45,37,28,3,{"$f":"G13/$G$11*$L$11","v":76.923076923076934},{"$f":"H13/$G$11*$L$11","v":69.230769230769226},56.92307692307692,43.07692307692308]
[4,5.4,{"$f":"B14*1.2","v":6.48},{"$f":"B14*1.3","v":7.0200000000000005},{"$f":"B14*1.4","v":7.56},4,38,35,32,23,4,{"$f":"G14/$G$11*$L$11","v":58.461538461538467},{"$f":"H14/$G$11*$L$11","v":53.846153846153847},49.230769230769234,35.384615384615387]
[]
{"$rows_left_out":43}
{"sheet":"GrunndataEnkel","index":7,"n_rows":57,"n_cols":17,"rows_kept":57,"cut":false,"hidden":true,"merged":[]}
[null,"Korreksjonsfaktor",null,null,null,null,"Faktorer",null,null,null,"Terrengkjøring  G15-min/m3ub/100m"]
[null,null,"Helning",null,null,null,"Overflate","Helning",null,null,null,"Helning"]
["Overflate",1,2,3,4,1,1.1000000000000001,1.0009999999999999,"m3ub/lass","Overflate",1,2,3,4]
[1,{"$f":"G3*$H$3","v":1.1011},{"$f":"G3*$H$4","v":1.1121000000000001},{"$f":"G3*$H$5","v":1.1341000000000001},{"$f":"G3*$H$6","v":1.1847000000000001},2,1.2,1.0109999999999999,15,1,{"$f":"216/G11/$I$4","v":0.22153846153846155},0.22857142857142856,0.25263157894736843,0.34285714285714286]
[2,{"$f":"G4*$H$3","v":1.2011999999999998},{"$f":"G4*$H$4","v":1.2131999999999998},{"$f":"G4*$H$5","v":1.2371999999999999},{"$f":"G4*$H$6","v":1.2924},3,1.35,1.0309999999999999,null,2,0.24827586206896551,0.27169811320754716,0.30638297872340431,0.4363636363636364]
[3,{"$f":"G5*$H$3","v":1.3513500000000001},{"$f":"G5*$H$4","v":1.3648499999999999},{"$f":"G5*$H$5","v":1.39185},{"$f":"G5*$H$6","v":1.4539500000000001},4,1.5,1.077,null,3,0.28800000000000003,0.32,0.38918918918918916,0.51428571428571435]
[4,{"$f":"G6*$H$3","v":1.5014999999999998},{"$f":"G6*$H$4","v":1.5164999999999997},{"$f":"G6*$H$5","v":1.5465},{"$f":"G6*$H$6","v":1.6154999999999999},null,null,null,null,4,0.37894736842105264,0.41142857142857142,0.45,0.62608695652173918]
[null,"Ganghastigher",null,"min/100m",null,"    Terrengkjøring  m/min- lassbærer",null,null,null,null,"    Terrengkjøring  m/min- stammel./traktor"]
[null,null,"Helning",null,null,null,null,"Helning",null,null,null,null,"Helning"]
["Overflate",1,2,3,4,"Overflate",1,2,3,4,"Overflate",1,2,3,4]
[1,3,{"$f":"B11*1.2","v":3.5999999999999996},{"$f":"B11*1.3","v":3.9000000000000004},{"$f":"B11*1.4","v":4.1999999999999993},1,65,63,57,42,1,100,{"$f":"H11/$G$11*$L$11","v":96.92307692307692},{"$f":"I11/$G$11*$L$11","v":87.692307692307693},64.615384615384613]
[2,3.8,{"$f":"B12*1.2","v":4.5599999999999996},{"$f":"B12*1.3","v":4.9399999999999995},{"$f":"B12*1.4","v":5.3199999999999994},2,58,53,47,33,2,{"$f":"G12/$G$11*$L$11","v":89.230769230769241},{"$f":"H12/$G$11*$L$11","v":81.538461538461533},72.307692307692307,50.769230769230766]
[3,4.5999999999999996,{"$f":"B13*1.2","v":5.52},{"$f":"B13*1.3","v":5.9799999999999995},{"$f":"B13*1.4","v":6.4399999999999995},3,50,45,37,28,3,{"$f":"G13/$G$11*$L$11","v":76.923076923076934},{"$f":"H13/$G$11*$L$11","v":69.230769230769226},56.92307692307692,43.07692307692308]
[4,5.4,{"$f":"B14*1.2","v":6.48},{"$f":"B14*1.3","v":7.0200000000000005},{"$f":"B14*1.4","v":7.56},4,38,35,32,23,4,{"$f":"G14/$G$11*$L$11","v":58.461538461538467},{"$f":"H14/$G$11*$L$11","v":53.846153846153847},49.230769230769234,35.384615384615387]
[]
{"$rows_left_out":42}